Cronyx Site
About Cronyx
Products Prices Contact information Search English 
English Russian  Russian
Software Payment
What's new
F. A. Q.
Partners
Vacancies
Forum
Site map


Форум cronyx.ru

Зарегистрироваться  |  Поиск

Установка sigma22jackus  ::  2004-02-26 09:59

При попытке компиляции драйвера для sigma22 (4.4.0) на linux (RedHat9,
ядро 2.4.20) выдает ошибку:

async.c: In function `asy_ioctl':
async.c:764: `boot_cpu_data_R0657d037' undeclared (first use in this function)
make[2]: *** [async.o] Ошибка 1
make[2]: Выход из каталог `/usr/src/clinux/module-2.4.20-8'
make[1]: *** [_mod_/usr/src/clinux/module-2.4.20-8] Ошибка 2
make[1]: Выход из каталог `/usr/src/linux-2.4.20-8'
make: *** [modules] Ошибка 2

подскажите, что необходимо сделать для исправления ситуации.

E-mail:

Пароль:
 Забыли пароль?

Тема:

Сообщение:

Copyright © 1996-2018 Cronyx
www-adm@cronyx.ru